{"text_format":"1","workbook":"xlsx","n_sheets":3,"sheets":["작업일지","입력","참고"],"not_rendered":{"charts":0,"images":0,"macros":1,"external_links":0,"defined_names":5,"comments":0,"pivot_tables":0},"unopened":[],"bounds":{"document_bytes":16777216,"sheet_cells":100000,"rows_first":2000,"rows_last":500,"rows_between":2000,"halvings":0,"cell_chars":16384,"cell_head_chars":4096},"cells_cut":0,"cells_raw":0,"read":"whole","date_system":"1900"}

{"sheet":"작업일지","index":0,"n_rows":8,"n_cols":2,"rows_kept":8,"cut":false,"hidden":false,"merged":[]}
[161120,"최초 만듬"]
[]
[null,"입력된 실 자료를 불러내서 수정하는 기능"]
[161120,"교실 미선택시 오류 알림"]
[161121,"교실명에 숫자추가하여 정렬기능 추가"]
[161121,"메뉴명 순서를 양식에 맞춰 재배치"]
[161121,"변경된 부분에 색 표시 추가"]
[170612,"입력자료 이력조회 기능 추가"]

{"sheet":"입력","index":1,"n_rows":176,"n_cols":42,"rows_kept":176,"cut":false,"hidden":false,"merged":[]}
["저장시간","교실명","바닥재","도장(내벽)","천장재","외부창방식","재질","실내창","복도창방식","재질","출입문형태","재질","양변기","화변기","소변기","냉방","난방","겸용","LED","할로겐","형광등","방전등","기타","바닥재","내벽재","천장재","외부창","실내창","복도창","출입문","양변기","화변기","소변기","냉방기","난방기","겸용","LED","할로겐","형광등","방전등","기타등"]
["16-12-31  AM 10:49:13","1.교장실","목재후로링","기타","기타","단창","AL(알루미늄)",null,null,null,"여닫이","WD(목재)",0,0,0,null,null,null,56,0,0,0,0,false,false,false,false,false,false,false,false,false,false,false,false,false,false,false,false,false,false]
["16-12-31  AM 10:49:13","2.행정실","테라조타일","본타일","텍스","단창","AL(알루미늄)",null,null,null,"여닫이","WD(목재)",0,0,0,null,null,null,8,0,0,0,0,false,false,false,false,false,false,false,false,false,false,false,false,false,false,false,false,false,false]
["16-12-31  AM 10:49:13","3.행정 1층 복도","테라조타일","기타","기타",null,null,null,"단창","AL(알루미늄)","여닫이","기타",0,0,0,null,null,null,0,0,0,0,47,false,false,false,false,false,false,false,false,false,false,false,false,false,false,false,false,false,false]
["16-12-31  AM 10:49:13","4.행정 1층 화장실","타일","타일","SMC","단창","AL(알루미늄)",null,null,null,"여닫이","SSD(스테인리스)",0,2,2,null,null,null,0,0,0,0,3,false,false,false,false,false,false,false,false,false,false,false,false,false,false,false,false,false,false]
["16-12-31  AM 10:49:13","5.행정 1층 1/2","석재","본타일","노출천정","단창","AL(알루미늄)",null,null,null,null,null,0,0,0,null,null,null,0,0,0,0,1,false,false,false,false,false,false,false,false,false,false,false,false,false,false,false,false,false,false]
["16-12-31  AM 10:49:13","6.회의실","테라조타일","기타","텍스","단창","AL(알루미늄)",null,null,null,"여닫이","SSD(스테인리스)",0,0,0,null,null,null,0,0,10,0,0,false,false,false,false,false,false,false,false,false,false,false,false,false,false,false,false,false,false]
["16-12-31  AM 10:49:13","7.멀티실","액세스후로어","본타일","텍스","단창","AL(알루미늄)","PL(플라스틱)",null,null,"여닫이","WD(목재)",0,0,0,null,null,null,0,0,12,0,0,false,false,false,false,false,false,false,false,false,false,false,false,false,false,false,false,false,false]
["16-12-31  AM 10:49:13","8.진로활동실","액세스후로어","기타","텍스","단창","AL(알루미늄)","PL(플라스틱)",null,null,"여닫이","WD(목재)",0,0,0,null,null,null,0,0,4,0,0,false,false,false,false,false,false,false,false,false,false,false,false,false,false,false,false,false,false]
["16-12-31  AM 10:49:13","9.행정 2층 복도","테라조타일","본타일","텍스",null,null,null,"단창","AL(알루미늄)",null,null,0,0,0,null,null,null,0,0,6,0,0,false,false,false,false,false,false,false,false,false,false,false,false,false,false,false,false,false,false]
["16-12-31  AM 10:49:13","10.행정 2층 화장실","타일","타일","SMC","단창","AL(알루미늄)",null,null,null,"여닫이","SSD(스테인리스)",0,2,0,null,null,null,0,0,0,0,3,false,false,false,false,false,false,false,false,false,false,false,false,false,false,false,false,false,false]
["16-12-31  AM 10:49:13","11.행정 2층 2/3","석재","본타일","노출천정","단창","AL(알루미늄)",null,null,null,null,null,0,0,0,null,null,null,0,0,0,0,1,false,false,false,false,false,false,false,false,false,false,false,false,false,false,false,false,false,false]
["16-12-31  AM 10:49:13","12.아성반","테라조타일","본타일","텍스","단창","AL(알루미늄)",null,null,null,"여닫이","SSD(스테인리스)",0,0,0,null,null,null,62,0,0,0,0,false,false,false,false,false,false,false,false,false,false,false,false,false,false,false,false,false,false]
["16-12-31  AM 10:49:13","13.행정 3층 복도","테라조타일","본타일","텍스",null,null,null,"단창","AL(알루미늄)",null,null,0,0,0,null,null,null,0,0,0,0,2,false,false,false,false,false,false,false,false,false,false,false,false,false,false,false,false,false,false]
["16-12-31  AM 10:49:13","14.행정 3층 화장실","타일","타일","SMC","단창","AL(알루미늄)",null,null,null,"여닫이","SSD(스테인리스)",0,2,2,null,null,null,0,0,0,0,3,false,false,false,false,false,false,false,false,false,false,false,false,false,false,false,false,false,false]
["16-12-31  AM 10:49:13","15.행정 3층 3/옥상","석재","본타일","텍스","단창","AL(알루미늄)",null,null,null,null,null,0,0,0,null,null,null,0,0,3,0,0,false,false,false,false,false,false,false,false,false,false,false,false,false,false,false,false,false,false]
["16-12-31  AM 10:49:13","16.선수대기실","비닐계타일","수성페인트","텍스","단창","PL(플라스틱)",null,null,null,"여닫이","SSD(스테인리스)",0,0,0,null,null,null,0,0,2,0,0,false,false,false,false,false,false,false,false,false,false,false,false,false,false,false,false,false,false]
["16-12-31  AM 10:49:13","17.체육관","탄성후로어","수성페인트","노출천정","단창","PL(플라스틱)",null,null,null,"여닫이","SSD(스테인리스)",0,0,0,null,null,null,0,0,0,54,0,false,false,false,false,false,false,false,false,false,false,false,false,false,false,false,false,false,false]
["16-12-31  AM 10:49:13","18.2층 관람석","기타","수성페인트","노출천정","단창","PL(플라스틱)",null,null,null,"미닫이","기타",0,0,0,null,null,null,0,0,0,0,12,false,false,false,false,false,false,false,false,false,false,false,false,false,false,false,false,false,false]
["16-12-31  AM 10:49:13","19.감독실","테라조타일","기타","텍스",null,null,"PL(플라스틱)",null,null,"여닫이","SSD(스테인리스)",0,0,0,null,null,null,0,0,2,0,0,false,false,false,false,false,false,false,false,false,false,false,false,false,false,false,false,false,false]
["16-12-31  AM 10:49:13","20.씨름장","기타","수성페인트",null,"단창","PL(플라스틱)",null,null,null,"여닫이","SSD(스테인리스)",0,0,0,null,null,null,0,0,0,22,0,false,false,false,false,false,false,false,false,false,false,false,false,false,false,false,false,false,false]
["16-12-31  AM 10:49:13","21.샤워실","석재","타일","기타","단창","PL(플라스틱)",null,null,null,null,null,0,0,0,null,null,null,0,0,0,0,7,false,false,false,false,false,false,false,false,false,false,false,false,false,false,false,false,false,false]
["16-12-31  AM 10:49:13","22.씨름장 홀","테라조타일","수성페인트","텍스",null,null,null,null,null,"여닫이","기타",0,0,0,null,null,null,0,0,0,0,0,false,false,false,false,false,false,false,false,false,false,false,false,false,false,false,false,false,false]
["16-12-31  AM 10:49:13","23.씨름장 계단실","기타","수성페인트",null,null,null,null,null,null,null,null,0,0,0,null,null,null,0,0,0,0,0,false,false,false,false,false,false,false,false,false,false,false,false,false,false,false,false,false,false]
["16-12-31  AM 10:49:13","24.씨름장 화장실","타일","타일","텍스",null,null,null,null,null,"여닫이","SSD(스테인리스)",0,0,0,null,null,null,0,0,0,0,4,false,false,false,false,false,false,false,false,false,false,false,false,false,false,false,false,false,false]
["16-12-31  AM 10:49:13","25.씨름부 숙소","비닐계타일","벽지",null,"단창","PL(플라스틱)",null,null,null,"여닫이","WD(목재)",0,0,0,null,null,null,0,0,0,0,13,false,false,false,false,false,false,false,false,false,false,false,false,false,false,false,false,false,false]
["16-12-31  AM 10:49:13","26.생활체육실","테라조타일","수성페인트",null,"단창","PL(플라스틱)",null,null,null,"여닫이","SSD(스테인리스)",0,0,0,null,null,null,22,0,0,0,0,false,false,false,false,false,false,false,false,false,false,false,false,false,false,false,false,false,false]
["16-12-31  AM 10:49:13","27.수위실",null,null,null,null,null,null,null,null,null,null,0,0,0,null,null,null,0,0,0,0,0,false,false,false,false,false,false,false,false,false,false,false,false,false,false,false,false,false,false]
["16-12-31  AM 10:49:13","28.소강당","기타","흡음재","텍스","이중창","PL(플라스틱)",null,null,null,"여닫이","기타",0,0,0,null,null,null,0,0,0,0,24,false,false,false,false,false,false,false,false,false,false,false,false,false,false,false,false,false,false]
["16-12-31  AM 10:49:13","29.중 진로활동실","비닐계타일","기타","텍스","단창","PL(플라스틱)",null,null,null,"여닫이","기타",0,0,0,null,null,null,6,0,0,0,0,false,false,false,false,false,false,false,false,false,false,false,false,false,false,false,false,false,false]
["16-12-31  AM 10:49:13","30.중 가사실","비닐계타일","기타","텍스","단창","PL(플라스틱)",null,null,null,"여닫이","기타",0,0,0,null,null,null,8,0,0,0,0,false,false,false,false,false,false,false,false,false,false,false,false,false,false,false,false,false,false]
["16-12-31  AM 10:49:13","31.소강당 2층 복도","비닐계타일","기타","텍스",null,null,null,"단창","PL(플라스틱)","여닫이","기타",0,0,0,null,null,null,3,0,0,0,0,false,false,false,false,false,false,false,false,false,false,false,false,false,false,false,false,false,false]
["16-12-31  AM 10:49:13","32.중 멀티실","석재","벽지","텍스","단창","PL(플라스틱)","PL(플라스틱)",null,null,"여닫이","WD(목재)",0,0,0,null,null,null,0,0,12,0,0,false,false,false,false,false,false,false,false,false,false,false,false,false,false,false,false,false,false]
["16-12-31  AM 10:49:13","33.중 음악실","석재","기타","텍스","단창","PL(플라스틱)",null,null,null,"여닫이","기타",0,0,0,null,null,null,0,0,12,0,0,false,false,false,false,false,false,false,false,false,false,false,false,false,false,false,false,false,false]
["16-12-31  AM 10:49:13","34.소강당 3층 계단실","석재","수성페인트","노출천정","단창","기타",null,null,null,null,null,0,0,0,null,null,null,0,0,12,0,0,false,false,false,false,false,false,false,false,false,false,false,false,false,false,false,false,false,false]
["16-12-31  AM 10:49:13","35.사열대(운동장)",null,null,null,null,null,null,null,null,null,null,0,0,0,null,null,null,0,0,0,0,0,false,false,false,false,false,false,false,false,false,false,false,false,false,false,false,false,false,false]
["16-12-31  AM 10:49:13","36.문서창고",null,null,null,null,null,null,null,null,null,null,0,0,0,null,null,null,0,0,0,0,0,false,false,false,false,false,false,false,false,false,false,false,false,false,false,false,false,false,false]
["16-12-31  AM 10:49:13","37.공구창고",null,null,null,null,null,null,null,null,null,null,0,0,0,null,null,null,0,0,0,0,0,false,false,false,false,false,false,false,false,false,false,false,false,false,false,false,false,false,false]
["16-12-31  AM 10:49:13","38.비품창고",null,null,null,null,null,null,null,null,null,null,0,0,0,null,null,null,0,0,0,0,0,false,false,false,false,false,false,false,false,false,false,false,false,false,false,false,false,false,false]
["16-12-31  AM 10:49:13","39.월파도서관","석재","기타","텍스","단창","PL(플라스틱)",null,null,null,null,null,0,0,0,null,null,null,0,0,0,0,142,false,false,false,false,false,false,false,false,false,false,false,false,false,false,false,false,false,false]
["16-12-31  AM 10:49:13","40.도서관 1층 복도","석재","수성페인트","SMC",null,null,null,null,null,null,null,0,0,0,null,null,null,6,0,0,0,0,false,false,false,false,false,false,false,false,false,false,false,false,false,false,false,false,false,false]
["16-12-31  AM 10:49:13","41.장애인화장실(여)","타일","타일","SMC","단창","기타",null,null,null,"여닫이","WD(목재)",1,0,0,null,null,null,0,0,0,0,2,false,false,false,false,false,false,false,false,false,false,false,false,false,false,false,false,false,false]
["16-12-31  AM 10:49:13","42.장애인화장실(남)","타일","타일","SMC","단창","기타",null,null,null,"여닫이","WD(목재)",1,0,0,null,null,null,0,0,0,0,2,false,false,false,false,false,false,false,false,false,false,false,false,false,false,false,false,false,false]
["16-12-31  AM 10:49:13","43.도서관 1층 화장실(남)","타일","타일","SMC","단창","PL(플라스틱)",null,null,null,"미닫이","기타",0,2,4,null,null,null,0,0,0,0,7,false,false,false,false,false,false,false,false,false,false,false,false,false,false,false,false,false,false]
["16-12-31  AM 10:49:13","44.도서관 1층 화장실(여)","타일","타일","SMC","단창","PL(플라스틱)",null,null,null,"미닫이","기타",0,4,0,null,null,null,0,0,0,0,7,false,false,false,false,false,false,false,false,false,false,false,false,false,false,false,false,false,false]
["16-12-31  AM 10:49:13","45.도서관 1층 1/2","석재","수성페인트","노출천정","단창","AL(알루미늄)",null,null,null,null,null,0,0,0,null,null,null,0,0,0,0,1,false,false,false,false,false,false,false,false,false,false,false,false,false,false,false,false,false,false]
["16-12-31  AM 10:49:13","46.1학년 교무실","테라조타일","기타","텍스","단창","PL(플라스틱)","PL(플라스틱)",null,null,"미닫이","PD(플라스틱)",0,0,0,null,null,null,8,0,0,0,0,false,false,false,false,false,false,false,false,false,false,false,false,false,false,false,false,false,false]
["16-12-31  AM 10:49:13","47.1학년 1반","테라조타일","수성페인트","텍스","단창","PL(플라스틱)","PL(플라스틱)",null,null,"미닫이","PD(플라스틱)",0,0,0,null,null,null,11,0,0,0,0,false,false,false,false,false,false,false,false,false,false,false,false,false,false,false,false,false,false]
["16-12-31  AM 10:49:13","48.1학년 7반","테라조타일","수성페인트","텍스","단창","PL(플라스틱)","PL(플라스틱)",null,null,"미닫이","PD(플라스틱)",0,0,0,null,null,null,11,0,0,0,0,false,false,false,false,false,false,false,false,false,false,false,false,false,false,false,false,false,false]
["16-12-31  AM 10:49:13","49.도서관 2층 복도","테라조타일","수성페인트","텍스",null,null,null,null,null,null,null,0,0,0,null,null,null,11,0,0,0,0,false,false,false,false,false,false,false,false,false,false,false,false,false,false,false,false,false,false]
["16-12-31  AM 10:49:13","50.도서관 2층 화장실(여)","타일","타일","SMC","단창","PL(플라스틱)",null,null,null,"미닫이","기타",0,4,0,null,null,null,7,0,0,0,0,false,false,false,false,false,false,false,false,false,false,false,false,false,false,false,false,false,false]
["16-12-31  AM 10:49:13","51.도서관 2층 화장실(남)","타일","타일","SMC","단창","PL(플라스틱)",null,null,null,"미닫이","기타",0,2,4,null,null,null,7,0,0,0,0,false,false,false,false,false,false,false,false,false,false,false,false,false,false,false,false,false,false]
["16-12-31  AM 10:49:13","52.도서관 2층 2/3","석재","수성페인트","노출천정","단창","AL(알루미늄)",null,null,null,null,null,0,0,0,null,null,null,0,0,0,0,1,false,false,false,false,false,false,false,false,false,false,false,false,false,false,false,false,false,false]
["16-12-31  AM 10:49:13","53.1학년 4반","테라조타일","수성페인트","텍스","단창","PL(플라스틱)","PL(플라스틱)",null,null,"미닫이","PD(플라스틱)",0,0,0,null,null,null,11,0,0,0,0,false,false,false,false,false,false,false,false,false,false,false,false,false,false,false,false,false,false]
["16-12-31  AM 10:49:13","54.1학년 2반","테라조타일","수성페인트","텍스","단창","PL(플라스틱)","PL(플라스틱)",null,null,"미닫이","PD(플라스틱)",0,0,0,null,null,null,11,0,0,0,0,false,false,false,false,false,false,false,false,false,false,false,false,false,false,false,false,false,false]
["16-12-31  AM 10:49:13","55.1학년 3반","테라조타일","수성페인트","텍스","단창","PL(플라스틱)","PL(플라스틱)",null,null,"미닫이","PD(플라스틱)",0,0,0,null,null,null,11,0,0,0,0,false,false,false,false,false,false,false,false,false,false,false,false,false,false,false,false,false,false]
["16-12-31  AM 10:49:13","56.도서관 3층 복도","테라조타일","수성페인트","텍스","단창","PL(플라스틱)",null,null,null,null,null,0,0,0,null,null,null,13,0,0,0,0,false,false,false,false,false,false,false,false,false,false,false,false,false,false,false,false,false,false]
["16-12-31  AM 10:49:13","57.도서관 3층 화장실(여)","타일","타일","SMC","단창","PL(플라스틱)",null,null,null,"미닫이","기타",0,4,0,null,null,null,0,0,0,0,7,false,false,false,false,false,false,false,false,false,false,false,false,false,false,false,false,false,false]
["16-12-31  AM 10:49:13","58.도서관 3층 화장실(남)","타일","타일","SMC","단창","PL(플라스틱)",null,null,null,"미닫이","기타",0,2,4,null,null,null,0,0,0,0,7,false,false,false,false,false,false,false,false,false,false,false,false,false,false,false,false,false,false]
["16-12-31  AM 10:49:13","59.도서관 3층 3/4","석재","수성페인트","노출천정","단창","AL(알루미늄)",null,null,null,null,null,0,0,0,null,null,null,0,0,0,0,1,false,false,false,false,false,false,false,false,false,false,false,false,false,false,false,false,false,false]
{"$rows_left_out":117}
{"sheet":"참고","index":2,"n_rows":186,"n_cols":5,"rows_kept":186,"cut":false,"hidden":false,"merged":[]}
["1.교장실","단창","미닫이","메모",{"$f":"VLOOKUP(A1,입력!B:B,1,FALSE)","v":"1.교장실"}]
["2.행정실","이중창","여닫이","목록에 없거나 한번더 확인이 필요할 경우 옆에 체크박스를 눌러 저장하세요",{"$f":"VLOOKUP(A2,입력!B:B,1,FALSE)","v":"2.행정실"}]
["3.행정 1층 복도",null,null,null,{"$f":"VLOOKUP(A3,입력!B:B,1,FALSE)","v":"3.행정 1층 복도"}]
["4.행정 1층 화장실",null,null,null,{"$f":"VLOOKUP(A4,입력!B:B,1,FALSE)","v":"4.행정 1층 화장실"}]
["5.행정 1층 1/2",null,null,null,{"$f":"VLOOKUP(A5,입력!B:B,1,FALSE)","v":"5.행정 1층 1/2"}]
["6.회의실",null,null,null,{"$f":"VLOOKUP(A6,입력!B:B,1,FALSE)","v":"6.회의실"}]
["7.멀티실",null,null,null,{"$f":"VLOOKUP(A7,입력!B:B,1,FALSE)","v":"7.멀티실"}]
["8.진로활동실",null,null,null,{"$f":"VLOOKUP(A8,입력!B:B,1,FALSE)","v":"8.진로활동실"}]
["9.행정 2층 복도",null,null,null,{"$f":"VLOOKUP(A9,입력!B:B,1,FALSE)","v":"9.행정 2층 복도"}]
["10.행정 2층 화장실",null,null,null,{"$f":"VLOOKUP(A10,입력!B:B,1,FALSE)","v":"10.행정 2층 화장실"}]
["11.행정 2층 2/3",null,null,null,{"$f":"VLOOKUP(A11,입력!B:B,1,FALSE)","v":"11.행정 2층 2/3"}]
["12.아성반",null,null,null,{"$f":"VLOOKUP(A12,입력!B:B,1,FALSE)","v":"12.아성반"}]
["13.행정 3층 복도",null,null,null,{"$f":"VLOOKUP(A13,입력!B:B,1,FALSE)","v":"13.행정 3층 복도"}]
["14.행정 3층 화장실",null,null,null,{"$f":"VLOOKUP(A14,입력!B:B,1,FALSE)","v":"14.행정 3층 화장실"}]
["15.행정 3층 3/옥상",null,null,null,{"$f":"VLOOKUP(A15,입력!B:B,1,FALSE)","v":"15.행정 3층 3/옥상"}]
["▶▶체육관동"]
["16.선수대기실",null,null,null,{"$f":"VLOOKUP(A17,입력!B:B,1,FALSE)","v":"16.선수대기실"}]
["17.체육관",null,null,null,{"$f":"VLOOKUP(A18,입력!B:B,1,FALSE)","v":"17.체육관"}]
["18.2층 관람석",null,null,null,{"$f":"VLOOKUP(A19,입력!B:B,1,FALSE)","v":"18.2층 관람석"}]
["▶▶씨름장동"]
["19.감독실",null,null,null,{"$f":"VLOOKUP(A21,입력!B:B,1,FALSE)","v":"19.감독실"}]
["20.씨름장",null,null,null,{"$f":"VLOOKUP(A22,입력!B:B,1,FALSE)","v":"20.씨름장"}]
["21.샤워실",null,null,null,{"$f":"VLOOKUP(A23,입력!B:B,1,FALSE)","v":"21.샤워실"}]
["22.씨름장 홀",null,null,null,{"$f":"VLOOKUP(A24,입력!B:B,1,FALSE)","v":"22.씨름장 홀"}]
["23.씨름장 계단실",null,null,null,{"$f":"VLOOKUP(A25,입력!B:B,1,FALSE)","v":"23.씨름장 계단실"}]
["24.씨름장 화장실",null,null,null,{"$f":"VLOOKUP(A26,입력!B:B,1,FALSE)","v":"24.씨름장 화장실"}]
["25.씨름부 숙소",null,null,null,{"$f":"VLOOKUP(A27,입력!B:B,1,FALSE)","v":"25.씨름부 숙소"}]
["26.생활체육실",null,null,null,{"$f":"VLOOKUP(A28,입력!B:B,1,FALSE)","v":"26.생활체육실"}]
["▶▶수위실동"]
["27.수위실",null,null,null,{"$f":"VLOOKUP(A30,입력!B:B,1,FALSE)","v":"27.수위실"}]
["▶▶소강당동"]
["28.소강당",null,null,null,{"$f":"VLOOKUP(A32,입력!B:B,1,FALSE)","v":"28.소강당"}]
["29.중 진로활동실",null,null,null,{"$f":"VLOOKUP(A33,입력!B:B,1,FALSE)","v":"29.중 진로활동실"}]
["30.중 가사실",null,null,null,{"$f":"VLOOKUP(A34,입력!B:B,1,FALSE)","v":"30.중 가사실"}]
["31.소강당 2층 복도",null,null,null,{"$f":"VLOOKUP(A35,입력!B:B,1,FALSE)","v":"31.소강당 2층 복도"}]
["32.중 멀티실",null,null,null,{"$f":"VLOOKUP(A36,입력!B:B,1,FALSE)","v":"32.중 멀티실"}]
["33.중 음악실",null,null,null,{"$f":"VLOOKUP(A37,입력!B:B,1,FALSE)","v":"33.중 음악실"}]
["34.소강당 3층 계단실",null,null,null,{"$f":"VLOOKUP(A38,입력!B:B,1,FALSE)","v":"34.소강당 3층 계단실"}]
["▶▶사열대 및 조례대"]
["35.사열대(운동장)",null,null,null,{"$f":"VLOOKUP(A40,입력!B:B,1,FALSE)","v":"35.사열대(운동장)"}]
["▶▶문서창고동"]
["36.문서창고",null,null,null,{"$f":"VLOOKUP(A42,입력!B:B,1,FALSE)","v":"36.문서창고"}]
["37.공구창고",null,null,null,{"$f":"VLOOKUP(A43,입력!B:B,1,FALSE)","v":"37.공구창고"}]
["38.비품창고",null,null,null,{"$f":"VLOOKUP(A44,입력!B:B,1,FALSE)","v":"38.비품창고"}]
["▶▶도서관동"]
["39.월파도서관",null,null,null,{"$f":"VLOOKUP(A46,입력!B:B,1,FALSE)","v":"39.월파도서관"}]
["40.도서관 1층 복도",null,null,null,{"$f":"VLOOKUP(A47,입력!B:B,1,FALSE)","v":"40.도서관 1층 복도"}]
["41.장애인화장실(여)",null,null,null,{"$f":"VLOOKUP(A48,입력!B:B,1,FALSE)","v":"41.장애인화장실(여)"}]
["42.장애인화장실(남)",null,null,null,{"$f":"VLOOKUP(A49,입력!B:B,1,FALSE)","v":"42.장애인화장실(남)"}]
["43.도서관 1층 화장실(남)",null,null,null,{"$f":"VLOOKUP(A50,입력!B:B,1,FALSE)","v":"43.도서관 1층 화장실(남)"}]
["44.도서관 1층 화장실(여)",null,null,null,{"$f":"VLOOKUP(A51,입력!B:B,1,FALSE)","v":"44.도서관 1층 화장실(여)"}]
["45.도서관 1층 1/2",null,null,null,{"$f":"VLOOKUP(A52,입력!B:B,1,FALSE)","v":"45.도서관 1층 1/2"}]
["46.1학년 교무실",null,null,null,{"$f":"VLOOKUP(A53,입력!B:B,1,FALSE)","v":"46.1학년 교무실"}]
["47.1학년 1반",null,null,null,{"$f":"VLOOKUP(A54,입력!B:B,1,FALSE)","v":"47.1학년 1반"}]
["48.1학년 7반",null,null,null,{"$f":"VLOOKUP(A55,입력!B:B,1,FALSE)","v":"48.1학년 7반"}]
["49.도서관 2층 복도",null,null,null,{"$f":"VLOOKUP(A56,입력!B:B,1,FALSE)","v":"49.도서관 2층 복도"}]
["50.도서관 2층 화장실(여)",null,null,null,{"$f":"VLOOKUP(A57,입력!B:B,1,FALSE)","v":"50.도서관 2층 화장실(여)"}]
["51.도서관 2층 화장실(남)",null,null,null,{"$f":"VLOOKUP(A58,입력!B:B,1,FALSE)","v":"51.도서관 2층 화장실(남)"}]
["52.도서관 2층 2/3",null,null,null,{"$f":"VLOOKUP(A59,입력!B:B,1,FALSE)","v":"52.도서관 2층 2/3"}]
["53.1학년 4반",null,null,null,{"$f":"VLOOKUP(A60,입력!B:B,1,FALSE)","v":"53.1학년 4반"}]
{"$rows_left_out":126}